Target
Hypoxanthine phosphoribosyltransferase
Ligand
BDBM194491
Substrate
Meas. Tech.
Spectrophotometric Assay
pH
7.4±n/a
Ki
11000±600 nM
Comments
extracted
Citation
 De Jersey, JGuddat, LWHockova, DKeough, DT 6-oxopurine phosphoribosyltransferase inhibitors US Patent  US9200020 Publication Date 12/1/2015 
Target
Name:
Hypoxanthine phosphoribosyltransferase
Synonyms:
Hypoxanthine-guanine phosphoribosyltransferase (HGPRT)
Type:
Enzyme
Mol. Mass.:
26972.31
Organism:
Plasmodium vivax
Description:
A0A0J9TE27
Residue:
233
  
Inhibitor
Name:
BDBM194491
Synonyms:
US9200020, Table 1, Compound 2
Type:
Small organic molecule
Emp. Form.:
C9H16N6O4P
Mol. Mass.:
303.2349
SMILES:
Nc1nc2n(CCNCCP(O)(O)=O)c[nH]c2c(=O)[nH]1
: