Target
ALK tyrosine kinase receptor
Ligand
BDBM196882
Substrate
Meas. Tech.
Enzyme Inhibition Assay
pH
7.4±n/a
Temperature
298.15±n/a K
Ki
4±n/a nM
Comments
extracted
Citation
 Vasudevan, APenning, TDChen, HLiang, BWang, SWu, FShen, YLiu, CZou, ZPliushchev, M Bicyclic carboxamide inhibitors of kinases US Patent  US9212192 Publication Date 12/15/2015 
Target
Name:
ALK tyrosine kinase receptor
Synonyms:
ALK ALK_HUMAN CD_antigen: CD246
Type:
Protein
Mol. Mass.:
176453.10
Organism:
Homo sapiens (Human)
Description:
Q9UM73
Residue:
1620
  
Inhibitor
Name:
BDBM196882
Synonyms:
US9212192, 45
Type:
Small organic molecule
Emp. Form.:
C25H22Cl2F3N7O2
Mol. Mass.:
580.389
SMILES:
NC(=O)c1c(Nc2ccc(cc2OC(F)(F)F)N2CCNCC2)nc(Cc2c(Cl)cccc2Cl)c2nc[nH]c12
: