Target
ALK tyrosine kinase receptor
Ligand
BDBM196894
Substrate
Meas. Tech.
Enzyme Inhibition Assay
pH
7.4±n/a
Temperature
298.15±n/a K
Ki
2±n/a nM
Comments
extracted
Citation
 Vasudevan, APenning, TDChen, HLiang, BWang, SWu, FShen, YLiu, CZou, ZPliushchev, M Bicyclic carboxamide inhibitors of kinases US Patent  US9212192 Publication Date 12/15/2015 
Target
Name:
ALK tyrosine kinase receptor
Synonyms:
ALK ALK_HUMAN CD_antigen: CD246
Type:
Protein
Mol. Mass.:
176453.10
Organism:
Homo sapiens (Human)
Description:
Q9UM73
Residue:
1620
  
Inhibitor
Name:
BDBM196894
Synonyms:
US9212192, 57
Type:
Small organic molecule
Emp. Form.:
C26H28Cl2N8O2
Mol. Mass.:
555.459
SMILES:
CCc1nnc2c(C(N)=O)c(Nc3ccc(cc3OC)N3CCNCC3)nc(Cc3c(Cl)cccc3Cl)n12
: