Target
Enteropeptidase
Ligand
BDBM158082
Substrate
Meas. Tech.
Enteropeptidase Inhibition Assay
pH
8±n/a
Ki
0.49±n/a nM
Comments
extracted
Citation
 Koshiba, TTokumasu, MIchimaru, TOhsumi, KNakagawa, TYamada, TMatsumoto, KSuzuki, T Heteroarylcarboxylic acid ester derivative US Patent  US9227949 Publication Date 1/5/2016 
Target
Name:
Enteropeptidase
Synonyms:
ENTK PRSS7 | TMPRSS15
Type:
Enzyme
Mol. Mass.:
112901.62
Organism:
Homo sapiens (Human)
Description:
P98073
Residue:
1019
  
Inhibitor
Name:
BDBM158082
Synonyms:
US9024044, 10 | US9227949, 10
Type:
Small organic molecule
Emp. Form.:
C22H26FN3O5S
Mol. Mass.:
463.522
SMILES:
CCCN(CC(O)=O)C(=O)C(C)(C)Cc1ccc(s1)C(=O)Oc1ccc(cc1F)C(N)=N
: