Target
Enteropeptidase
Ligand
BDBM158119
Substrate
Meas. Tech.
Enteropeptidase Inhibition Assay
pH
8±n/a
Ki
0.53±n/a nM
Comments
extracted
Citation
 Koshiba, TTokumasu, MIchimaru, TOhsumi, KNakagawa, TYamada, TMatsumoto, KSuzuki, T Heteroarylcarboxylic acid ester derivative US Patent  US9227949 Publication Date 1/5/2016 
Target
Name:
Enteropeptidase
Synonyms:
ENTK PRSS7 | TMPRSS15
Type:
Enzyme
Mol. Mass.:
112901.62
Organism:
Homo sapiens (Human)
Description:
P98073
Residue:
1019
  
Inhibitor
Name:
BDBM158119
Synonyms:
US9024044, 47 | US9227949, 47
Type:
Small organic molecule
Emp. Form.:
C24H22FN3O6S
Mol. Mass.:
499.511
SMILES:
CC(C)(Cc1ccc(s1)C(=O)Oc1ccc(cc1F)C(N)=N)C(=O)Nc1ccc(O)c(c1)C(O)=O
: