Target
Enteropeptidase
Ligand
BDBM199974
Substrate
Meas. Tech.
Enteropeptidase Inhibition Assay
pH
8±n/a
Ki
0.43±n/a nM
Comments
extracted
Citation
 Koshiba, TTokumasu, MIchimaru, TOhsumi, KNakagawa, TYamada, TMatsumoto, KSuzuki, T Heteroarylcarboxylic acid ester derivative US Patent  US9227949 Publication Date 1/5/2016 
Target
Name:
Enteropeptidase
Synonyms:
ENTK PRSS7 | TMPRSS15
Type:
Enzyme
Mol. Mass.:
112901.62
Organism:
Homo sapiens (Human)
Description:
P98073
Residue:
1019
  
Inhibitor
Name:
BDBM199974
Synonyms:
BDBM308548 | US9227949, 84
Type:
Small organic molecule
Emp. Form.:
C24H28FN7O5S
Mol. Mass.:
545.586
SMILES:
CCC(CC)(Cc1ccc(s1)C(=O)Oc1ccc(cc1F)C(N)=N)C(=O)N[C@@H](CCC(O)=O)c1nnn[nH]1
: