Target
Enteropeptidase
Ligand
BDBM199977
Substrate
Meas. Tech.
Enteropeptidase Inhibition Assay
pH
8±n/a
Ki
0.39±n/a nM
Comments
extracted
Citation
 Koshiba, TTokumasu, MIchimaru, TOhsumi, KNakagawa, TYamada, TMatsumoto, KSuzuki, T Heteroarylcarboxylic acid ester derivative US Patent  US9227949 Publication Date 1/5/2016 
Target
Name:
Enteropeptidase
Synonyms:
ENTK PRSS7 | TMPRSS15
Type:
Enzyme
Mol. Mass.:
112901.62
Organism:
Homo sapiens (Human)
Description:
P98073
Residue:
1019
  
Inhibitor
Name:
BDBM199977
Synonyms:
US9227949, 87 | US9655879, 87
Type:
Small organic molecule
Emp. Form.:
C17H17FN2O4S
Mol. Mass.:
364.391
SMILES:
CC(C)(Cc1ccc(s1)C(=O)Oc1ccc(cc1F)C(N)=N)C(O)=O
: