Target
Cystic fibrosis transmembrane conductance regulator
Ligand
BDBM200231
Substrate
EC50
>67000±n/a nM
Citation
 PubChem, PC Phenotypic Assay to Identify Small Molecules that Upregulate Production of hCFTR in HeLa Cells PubChem Bioassay (2016)[AID] 
Target
Name:
Cystic fibrosis transmembrane conductance regulator
Synonyms:
ABCC7 CFTR Channel conductance-controlling ATPase | cAMP-dependent chloride channel
Type:
Enzyme Catalytic Domain
Mol. Mass.:
168171.30
Organism:
Homo sapiens (Human)
Description:
gi_90421313
Residue:
1480
  
Inhibitor
Name:
BDBM200231
Synonyms:
AB01004372-01 | cid_42067840
Type:
Small organic molecule
Emp. Form.:
C16H12FN3O2
Mol. Mass.:
297.2838
SMILES:
[O-][N+](=O)c1ccc2N(Cc3ccc(cc3F)C#N)CCc2c1
: