Target
Cystic fibrosis transmembrane conductance regulator
Ligand
BDBM200291
Substrate
EC50
>56000±n/a nM
Citation
 PubChem, PC Phenotypic Assay to Identify Small Molecules that Upregulate Production of hCFTR in HeLa Cells PubChem Bioassay (2016)[AID] 
Target
Name:
Cystic fibrosis transmembrane conductance regulator
Synonyms:
ABCC7 CFTR Channel conductance-controlling ATPase | cAMP-dependent chloride channel
Type:
Enzyme Catalytic Domain
Mol. Mass.:
168171.30
Organism:
Homo sapiens (Human)
Description:
gi_90421313
Residue:
1480
  
Inhibitor
Name:
BDBM200291
Synonyms:
AB01002406-01 | cid_25976507
Type:
Small organic molecule
Emp. Form.:
C17H12N2O3S2
Mol. Mass.:
356.419
SMILES:
O=C(OCc1coc(n1)-c1cccs1)c1sccc1-n1cccc1
: