Target
Epidermal growth factor receptor [T790M,L858R]
Ligand
BDBM202383
Substrate
Meas. Tech.
Cell Based Assay
EC50
300±n/a nM
Citation
 Lee, KNiu, DPetter, RCSingh, J Heteroaryl compounds and uses thereof US Patent  US9238629 Publication Date 1/19/2016 
Target
Name:
Epidermal growth factor receptor [T790M,L858R]
Synonyms:
EGFR EGFR_HUMAN ERBB1 Epidermal growth factor receptor (EGFR)(T790M/L858R) Epidermal growth factor receptor (T790M, L858R) Epidermal growth factor receptor(L858R, T790M) | HER1
Type:
Mol. Mass.:
134353.72
Organism:
Homo sapiens (Human)
Description:
P00533[T790M,L858R]
Residue:
1210
  
Inhibitor
Name:
BDBM202383
Synonyms:
US10081606, Compound I-15 US9765038, Compound I-15
Type:
Small organic molecule
Emp. Form.:
C21H19ClN4O4
Mol. Mass.:
426.853
SMILES:
COc1ccc(Nc2ncc(Cl)c(Oc3cccc(NC(=O)C=C)c3)n2)c(OC)c1
: