Target
Vascular endothelial growth factor receptor 3
Ligand
BDBM202462
Substrate
Meas. Tech.
VEGFR3 Biochemical Assay
pH
7.4±n/a
IC50
8±n/a nM
Comments
extracted
Citation
 Foitzik, RCMorrow, BJHemley, CFLunniss, GECamerino, MAGaname, DStupple, PALessene, RKersten, WJHarvey, AJHolmes, IP VEGFR3 inhibitors US Patent  US9238644 Publication Date 1/19/2016 
Target
Name:
Vascular endothelial growth factor receptor 3
Synonyms:
FLT-4 Fms-like tyrosine kinase 4 VEGFR-3 VGFR3_HUMAN Vascular endothelial growth factor receptor 3 (VEGFR-3) | Vascular endothelial growth factor receptor 3 (VEGFR3)
Type:
Protein
Mol. Mass.:
152749.58
Organism:
Homo sapiens (Human)
Description:
P35916-2
Residue:
1363
  
Inhibitor
Name:
BDBM202462
Synonyms:
US9238644, 64
Type:
Small organic molecule
Emp. Form.:
C23H22F3N5O2
Mol. Mass.:
457.4483
SMILES:
COc1ccc(Nc2ncc(c(CCc3ccccc3C3(CC3)C(N)=O)n2)C(F)(F)F)cn1
: