Target
Vascular endothelial growth factor receptor 3
Ligand
BDBM202464
Substrate
Meas. Tech.
VEGFR3 Biochemical Assay
pH
7.4±n/a
IC50
7±n/a nM
Comments
extracted
Citation
 Foitzik, RCMorrow, BJHemley, CFLunniss, GECamerino, MAGaname, DStupple, PALessene, RKersten, WJHarvey, AJHolmes, IP VEGFR3 inhibitors US Patent  US9238644 Publication Date 1/19/2016 
Target
Name:
Vascular endothelial growth factor receptor 3
Synonyms:
FLT-4 Fms-like tyrosine kinase 4 VEGFR-3 VGFR3_HUMAN Vascular endothelial growth factor receptor 3 (VEGFR-3) | Vascular endothelial growth factor receptor 3 (VEGFR3)
Type:
Protein
Mol. Mass.:
152749.58
Organism:
Homo sapiens (Human)
Description:
P35916-2
Residue:
1363
  
Inhibitor
Name:
BDBM202464
Synonyms:
US9238644, 66
Type:
Small organic molecule
Emp. Form.:
C25H28F3N7O
Mol. Mass.:
499.5313
SMILES:
NC(=O)C1(CC1)c1ccccc1CCc1nc(Nc2cnn(c2)C2CCNCC2)ncc1C(F)(F)F
: