Target
Orexin/Hypocretin receptor type 1
Ligand
BDBM50447804
Substrate
Meas. Tech.
In Vitro Assay: Intracellular Calcium Measurements
Temperature
310.15±n/a K
IC50
5±n/a nM
Comments
extracted
Citation
 Aissaoui, HBoss, CBrotschi, CHeidmann, BSifferlen, TWilliams, JT Lactam derivatives useful as orexin receptor antagonists US Patent  US9242970 Publication Date 1/26/2016 
Target
Name:
Orexin/Hypocretin receptor type 1
Synonyms:
HCRTR1 OX1R_HUMAN Orexin receptor type 1 (OR 1) Orexin receptor type 1 (OX1) Orexin receptor type 1 (OxR1) | Ox1r
Type:
Protein
Mol. Mass.:
47554.50
Organism:
Homo sapiens (Human)
Description:
O43613
Residue:
425
  
Inhibitor
Name:
BDBM50447804
Synonyms:
CHEMBL3113752 | US9242970, 57
Type:
Small organic molecule
Emp. Form.:
C25H24N2O4
Mol. Mass.:
416.4691
SMILES:
COc1ccnc(OC)c1C1CCCC(=O)N1Cc1ccc2oc3ccccc3c2c1
: