Target
Orexin receptor type 2
Ligand
BDBM203225
Substrate
Meas. Tech.
In Vitro Assay: Intracellular Calcium Measurements
Temperature
310.15±n/a K
IC50
5±n/a nM
Comments
extracted
Citation
 Aissaoui, HBoss, CBrotschi, CHeidmann, BSifferlen, TWilliams, JT Lactam derivatives useful as orexin receptor antagonists US Patent  US9242970 Publication Date 1/26/2016 
Target
Name:
Orexin receptor type 2
Synonyms:
HCRTR2 OX2R_HUMAN Orexin receptor type 2 (OR-2) Orexin receptor type 2 (OX2R) Ox-2-R | Ox2-R
Type:
Protein
Mol. Mass.:
50710.53
Organism:
Homo sapiens (Human)
Description:
O43614
Residue:
444
  
Inhibitor
Name:
BDBM203225
Synonyms:
US9242970, 408
Type:
Small organic molecule
Emp. Form.:
C24H19ClFNO3
Mol. Mass.:
423.864
SMILES:
COc1cccc(F)c1[C@@H]1C[C@H](Cl)C(=O)N1Cc1ccc2oc3ccccc3c2c1
: