Target
Bromodomain-containing protein 2 [348-455]
Ligand
BDBM205429
Substrate
Meas. Tech.
Bromodomains Assay for DiscoveRx Gene Symbol
Kd
18±0.0 nM
Citation
 Tanaka, MRoberts, JMSeo, HSSouza, APaulk, JScott, TGDeAngelo, SLDhe-Paganon, SBradner, JE Design and characterization of bivalent BET inhibitors. Nat Chem Biol 12:1089-1096 (2016)  
Target
Name:
Bromodomain-containing protein 2 [348-455]
Synonyms:
BET bromodomain 2(2) (BRD2(2)) BRD2-BD2 Bromodomain-containing protein 2 (aa 348-455) RING3
Type:
Mol. Mass.:
12751.52
Organism:
Homo sapiens (Human)
Description:
P25440[348-455]
Residue:
108
  
Inhibitor
Name:
BDBM205429
Synonyms:
(R)-JQ1 (3) US10925881, Name (R)-JQ1 US11117865, Compound JQ1 US11406645, Compound JQ1 US11890288, Compound (+)-JQ1 | US9320741, (R)-JQ1
Type:
Small organic molecule
Emp. Form.:
C23H25ClN4O2S
Mol. Mass.:
456.988
SMILES:
Cc1nnc2[C@@H](CC(=O)OC(C)(C)C)N=C(c3c(C)c(C)sc3-n12)c1ccc(Cl)cc1
: