Target
Acetylcholinesterase
Ligand
BDBM205982
Substrate
Meas. Tech.
AChE/BuChE Inhibition Assay
IC50
542±140 nM
Citation
 Thompson, CMBharate, S Benzothiazole-based pyridinium compounds US Patent  US9255091 Publication Date 2/9/2016 
Target
Name:
Acetylcholinesterase
Synonyms:
ACES_ELEEL Acetylcholinesterase (EeAChE) | ache
Type:
Enzyme
Mol. Mass.:
71812.79
Organism:
Electrophorus electricus (Electric eel)
Description:
Residue:
633
  
Inhibitor
Name:
BDBM205982
Synonyms:
US9255091, 4b
Type:
Small organic molecule
Emp. Form.:
C22H21FN3OS
Mol. Mass.:
394.484
SMILES:
COc1ccc2nc(NCCc3cc[n+](Cc4ccc(F)cc4)cc3)sc2c1
: