Target
Acetylcholinesterase
Ligand
BDBM205983
Substrate
Meas. Tech.
AChE/BuChE Inhibition Assay
IC50
408±91 nM
Citation
 Thompson, CMBharate, S Benzothiazole-based pyridinium compounds US Patent  US9255091 Publication Date 2/9/2016 
Target
Name:
Acetylcholinesterase
Synonyms:
ACES_ELEEL Acetylcholinesterase (EeAChE) | ache
Type:
Enzyme
Mol. Mass.:
71812.79
Organism:
Electrophorus electricus (Electric eel)
Description:
Residue:
633
  
Inhibitor
Name:
BDBM205983
Synonyms:
US9255091, 4c
Type:
Small organic molecule
Emp. Form.:
C22H20F2N3OS
Mol. Mass.:
412.475
SMILES:
COc1ccc2nc(NCCc3cc[n+](Cc4c(F)cccc4F)cc3)sc2c1
: