Target
Acetylcholinesterase
Ligand
BDBM205983
Substrate
Meas. Tech.
AChE/BuChE Inhibition Assay
IC50
203±20 nM
Citation
 Thompson, CMBharate, S Benzothiazole-based pyridinium compounds US Patent  US9255091 Publication Date 2/9/2016 
Target
Name:
Acetylcholinesterase
Synonyms:
ACES_HUMAN Acetylcholinesterase (AChE) | Acetylcholinesterase (human AChE)
Type:
Enzyme
Mol. Mass.:
67792.70
Organism:
Homo sapiens (Human)
Description:
P22303
Residue:
614
  
Inhibitor
Name:
BDBM205983
Synonyms:
US9255091, 4c
Type:
Small organic molecule
Emp. Form.:
C22H20F2N3OS
Mol. Mass.:
412.475
SMILES:
COc1ccc2nc(NCCc3cc[n+](Cc4c(F)cccc4F)cc3)sc2c1
: