Target
Acetylcholinesterase
Ligand
BDBM205984
Substrate
Meas. Tech.
AChE/BuChE Inhibition Assay
IC50
269±22 nM
Citation
 Thompson, CMBharate, S Benzothiazole-based pyridinium compounds US Patent  US9255091 Publication Date 2/9/2016 
Target
Name:
Acetylcholinesterase
Synonyms:
ACES_HUMAN Acetylcholinesterase (AChE) | Acetylcholinesterase (human AChE)
Type:
Enzyme
Mol. Mass.:
67792.70
Organism:
Homo sapiens (Human)
Description:
P22303
Residue:
614
  
Inhibitor
Name:
BDBM205984
Synonyms:
US9255091, 4d
Type:
Small organic molecule
Emp. Form.:
C21H18F2N3S
Mol. Mass.:
382.449
SMILES:
Fc1ccc(C[n+]2ccc(CCNc3nc4ccc(F)cc4s3)cc2)cc1
: