Target
Cholinesterase
Ligand
BDBM205981
Substrate
Meas. Tech.
AChE/BuChE Inhibition Assay
IC50
3013±465 nM
Citation
 Thompson, CMBharate, S Benzothiazole-based pyridinium compounds US Patent  US9255091 Publication Date 2/9/2016 
Target
Name:
Cholinesterase
Synonyms:
Acylcholine acylhydrolase Butyrylcholine esterase (BChE) Butyrylcholinesterase (BuChE) CHLE_HUMAN Cholinesterases Pseudocholinesterase
Type:
Homotetramer
Mol. Mass.:
68422.27
Organism:
Homo sapiens (Human)
Description:
P06276
Residue:
602
  
Inhibitor
Name:
BDBM205981
Synonyms:
US9255091, 4a
Type:
Small organic molecule
Emp. Form.:
C22H22N3OS
Mol. Mass.:
376.494
SMILES:
COc1ccc2nc(NCCc3cc[n+](Cc4ccccc4)cc3)sc2c1
: