Target
Cholinesterase
Ligand
BDBM205984
Substrate
Meas. Tech.
AChE/BuChE Inhibition Assay
IC50
8164±567 nM
Citation
 Thompson, CMBharate, S Benzothiazole-based pyridinium compounds US Patent  US9255091 Publication Date 2/9/2016 
Target
Name:
Cholinesterase
Synonyms:
Acylcholine acylhydrolase Butyrylcholine esterase (BChE) Butyrylcholinesterase (BuChE) CHLE_HUMAN Cholinesterases Pseudocholinesterase
Type:
Homotetramer
Mol. Mass.:
68422.27
Organism:
Homo sapiens (Human)
Description:
P06276
Residue:
602
  
Inhibitor
Name:
BDBM205984
Synonyms:
US9255091, 4d
Type:
Small organic molecule
Emp. Form.:
C21H18F2N3S
Mol. Mass.:
382.449
SMILES:
Fc1ccc(C[n+]2ccc(CCNc3nc4ccc(F)cc4s3)cc2)cc1
: