Target
Cholinesterase
Ligand
BDBM205985
Substrate
Meas. Tech.
AChE/BuChE Inhibition Assay
IC50
11886±1002 nM
Citation
 Thompson, CMBharate, S Benzothiazole-based pyridinium compounds US Patent  US9255091 Publication Date 2/9/2016 
Target
Name:
Cholinesterase
Synonyms:
Acylcholine acylhydrolase Butyrylcholine esterase (BChE) Butyrylcholinesterase (BuChE) CHLE_HUMAN Cholinesterases Pseudocholinesterase
Type:
Homotetramer
Mol. Mass.:
68422.27
Organism:
Homo sapiens (Human)
Description:
P06276
Residue:
602
  
Inhibitor
Name:
BDBM205985
Synonyms:
US9255091, 4e
Type:
Small organic molecule
Emp. Form.:
C21H18FN4O2S
Mol. Mass.:
409.456
SMILES:
[O-][N+](=O)c1ccc2nc(NCCc3cc[n+](Cc4ccc(F)cc4)cc3)sc2c1
: