Target
Dipeptidyl peptidase 4
Ligand
BDBM205997
Substrate
US9255098, Gly-Pro-7-amido-4-methylcoumarin
Meas. Tech.
DPP-IV Activity InhibitoryAssay
Temperature
298.15±n/a K
IC50
0.2±0 nM
Comments
extracted
Citation
 Wang, YXiang, YCen, GHuang, LLiu, JZhou, NZhang, J Xanthine derivative US Patent  US9255098 Publication Date 2/9/2016 
Target
Name:
Dipeptidyl peptidase 4
Synonyms:
ADABP Adenosine deaminase complexing protein 2 CD_antigen=CD26 DPP4 DPPIV Dipeptidyl peptidase 4 (DPP IV) Dipeptidyl peptidase 4 (DPP4) Dipeptidyl peptidase 4 membrane form Dipeptidyl peptidase IV Dipeptidyl peptidase IV (DDP-IV) Dipeptidyl peptidase IV membrane form Dipeptidyl peptidase-IV (DPP-4) T-cell activation antigen CD26 | TP103
Type:
Enzyme
Mol. Mass.:
88271.01
Organism:
Homo sapiens (Human)
Description:
P27487
Residue:
766
  
Inhibitor
Name:
BDBM205997
Synonyms:
US9255098, Ex. 3
Type:
Small organic molecule
Emp. Form.:
C23H24ClN7O2S
Mol. Mass.:
498
SMILES:
CC#CCn1c(nc2n(C)c(=O)n(Cc3nc4cc(Cl)ccc4s3)c(=O)c12)N1CCC[C@@H](N)C1
:
Substrate
Name:
BDBM11057
Synonyms:
1-(2-aminoacetyl)-N-(4-methyl-2-oxo-2H-chromen-7-yl)pyrrolidine-2-carboxamide hydrobromide Gly-Pro-7-amidomethylcoumarin | Gly-Pro-AMC
Type:
Small organic molecule
Emp. Form.:
C17H19N3O4
Mol. Mass.:
329.3505
SMILES:
Cc1cc(=O)oc2cc(NC(=O)C3CCCN3C(=O)CN)ccc12
: