Target
Serine/threonine-protein kinase pim-1
Ligand
BDBM50131278
Substrate
Meas. Tech.
PIM Kinase Binding Activity Assay
pH
7.2±n/a
Ki
0.013±n/a nM
Comments
extracted
Citation
 Do, SHu, HKolesnikov, ALee, WTsui, VHWang, XWen, Z Pyrazolo[3,4-c]pyridine compounds and methods of use US Patent  US9260425 Publication Date 2/16/2016 
Target
Name:
Serine/threonine-protein kinase pim-1
Synonyms:
PIM-1 Kinase PIM1_HUMAN Serine/threonine-protein kinase (PIM1) Serine/threonine-protein kinase PIM1 | Serine/threonine-protein kinase pim-1 (PIM1)
Type:
Protein
Mol. Mass.:
35681.82
Organism:
Homo sapiens (Human)
Description:
P11309
Residue:
313
  
Inhibitor
Name:
BDBM50131278
Synonyms:
CHEMBL3634760 | US9260425, 433
Type:
Small organic molecule
Emp. Form.:
C21H24N8
Mol. Mass.:
388.4689
SMILES:
Cc1ccc(nc1N1CCC[C@H](N)C1)-c1n[nH]c2cnc(cc12)-c1cnn(C)c1
: