Target
Serine/threonine-protein kinase pim-1
Ligand
BDBM206724
Substrate
Meas. Tech.
PIM Kinase Binding Activity Assay
pH
7.2±n/a
Ki
0.009±n/a nM
Comments
extracted
Citation
 Do, SHu, HKolesnikov, ALee, WTsui, VHWang, XWen, Z Pyrazolo[3,4-c]pyridine compounds and methods of use US Patent  US9260425 Publication Date 2/16/2016 
Target
Name:
Serine/threonine-protein kinase pim-1
Synonyms:
PIM-1 Kinase PIM1_HUMAN Serine/threonine-protein kinase (PIM1) Serine/threonine-protein kinase PIM1 | Serine/threonine-protein kinase pim-1 (PIM1)
Type:
Protein
Mol. Mass.:
35681.82
Organism:
Homo sapiens (Human)
Description:
P11309
Residue:
313
  
Inhibitor
Name:
BDBM206724
Synonyms:
US9260425, 486
Type:
Small organic molecule
Emp. Form.:
C23H26N8
Mol. Mass.:
414.5061
SMILES:
Cn1cc(cn1)-c1cc2c(n[nH]c2cn1)-c1ccc(C2CC2)c(n1)N1CCC[C@H](N)C1
: