Target
Serine/threonine-protein kinase pim-1
Ligand
BDBM50131224
Substrate
Meas. Tech.
PIM Kinase Binding Activity Assay
pH
7.2±n/a
Ki
0.01±n/a nM
Comments
extracted
Citation
 Do, SHu, HKolesnikov, ALee, WTsui, VHWang, XWen, Z Pyrazolo[3,4-c]pyridine compounds and methods of use US Patent  US9260425 Publication Date 2/16/2016 
Target
Name:
Serine/threonine-protein kinase pim-1
Synonyms:
PIM-1 Kinase PIM1_HUMAN Serine/threonine-protein kinase (PIM1) Serine/threonine-protein kinase PIM1 | Serine/threonine-protein kinase pim-1 (PIM1)
Type:
Protein
Mol. Mass.:
35681.82
Organism:
Homo sapiens (Human)
Description:
P11309
Residue:
313
  
Inhibitor
Name:
BDBM50131224
Synonyms:
CHEMBL3634783 | US9260425, 505
Type:
Small organic molecule
Emp. Form.:
C20H20N8
Mol. Mass.:
372.4264
SMILES:
Cc1cncc(n1)-c1cc2c(n[nH]c2cn1)-c1cccc(n1)N1CCNCC1
: