Target
Serine/threonine-protein kinase pim-1
Ligand
BDBM50131225
Substrate
Meas. Tech.
PIM Kinase Binding Activity Assay
pH
7.2±n/a
Ki
0.015±n/a nM
Comments
extracted
Citation
 Do, SHu, HKolesnikov, ALee, WTsui, VHWang, XWen, Z Pyrazolo[3,4-c]pyridine compounds and methods of use US Patent  US9260425 Publication Date 2/16/2016 
Target
Name:
Serine/threonine-protein kinase pim-1
Synonyms:
PIM-1 Kinase PIM1_HUMAN Serine/threonine-protein kinase (PIM1) Serine/threonine-protein kinase PIM1 | Serine/threonine-protein kinase pim-1 (PIM1)
Type:
Protein
Mol. Mass.:
35681.82
Organism:
Homo sapiens (Human)
Description:
P11309
Residue:
313
  
Inhibitor
Name:
BDBM50131225
Synonyms:
CHEMBL3634769 | US9260425, 515
Type:
Small organic molecule
Emp. Form.:
C21H22N8O
Mol. Mass.:
402.4524
SMILES:
CCn1cncc(-c2cc3c(n[nH]c3cn2)-c2cccc(n2)N2CCNCC2)c1=O
: