Target
Beta-2 adrenergic receptor
Ligand
BDBM50213120
Substrate
Meas. Tech.
Beta2-AR Binding Assay
pH
7.7±n/a
Kd
1950±n/a nM
Comments
extracted
Citation
 Wainer, IWBernier, MToll, LRJimenez, LA Use of fenoterol and fenoterol analogues in the treatment of glioblastomas and astrocytomas US Patent  US9492405 Publication Date 11/15/2016 
Target
Name:
Beta-2 adrenergic receptor
Synonyms:
ADRB2 ADRB2_HUMAN Beta-2 adrenoceptor | Beta-2 adrenoreceptor
Type:
Mol. Mass.:
46461.69
Organism:
Homo sapiens (Human)
Description:
P07550
Residue:
413
  
Inhibitor
Name:
BDBM50213120
Synonyms:
(R,S)-(-)-1-p-methoxyphenyl-2-(beta-3',5'-dihydroxyphenyl-beta-oxy)ethylaminopropane US10617654, Compound (R,S)-2 US9492405, (R,S)-2
Type:
Small organic molecule
Emp. Form.:
C18H23NO4
Mol. Mass.:
317.3795
SMILES:
COc1ccc(C[C@H](C)NC[C@H](O)c2cc(O)cc(O)c2)cc1
: