Target
Neurogenic locus notch homolog protein 1
Ligand
BDBM209881
Substrate
Meas. Tech.
Biological Assay
IC50
2.5±n/a nM
Citation
 Gavai, AVDeLucca, GVO'Malley, DGill, PQuesnelle, CAFink, BEZhao, YLee, FY Bis(fluoroalkyl)-1,4-benzodiazepinone compounds and prodrugs thereof US Patent  US9273014 Publication Date 3/1/2016 
Target
Name:
Neurogenic locus notch homolog protein 1
Synonyms:
NEXT NOTC1_HUMAN Neurogenic locus notch homolog protein 1 Notch 1 Notch 1 intracellular domain TAN1 hN1
Type:
Enzyme
Mol. Mass.:
272417.95
Organism:
Homo sapiens (Human)
Description:
P46531
Residue:
2555
  
Inhibitor
Name:
BDBM209881
Synonyms:
US9273014, 10
Type:
Small organic molecule
Emp. Form.:
C27H27ClF6N4O3
Mol. Mass.:
604.972
SMILES:
Cc1cc(C)cc(c1)C1=N[C@H](NC(=O)[C@H](CCC(F)(F)F)[C@H](CCC(F)(F)F)C(N)=O)C(=O)Nc2c(Cl)cccc12
: