Target
Egl nine homolog 1 [179-426]
Ligand
BDBM102347
Substrate
Meas. Tech.
Activity Assay
pH
7.5±n/a
Temperature
298.15±n/a K
IC50
12000±n/a nM
Comments
extracted
Citation
 Shalwitz, RGardner, JH Methods for increasing the stabilization of hypoxia inducible factor-α US Patent  US9278930 Publication Date 3/8/2016 
Target
Name:
Egl nine homolog 1 [179-426]
Synonyms:
C1orf12 EGLN1_HUMAN | Hypoxia-inducible factor prolyl hydroxylase 2 (HIFPH2)
Type:
Mol. Mass.:
27759.84
Organism:
Homo sapiens (Human)
Description:
EGLN-1-179/426
Residue:
248
  
Inhibitor
Name:
BDBM102347
Synonyms:
US10562854, No. C1 US9278930, C1
Type:
Small organic molecule
Emp. Form.:
C20H19ClN2O2
Mol. Mass.:
354.83
SMILES:
Oc1c(CNCc2ccccc2)ccn(Cc2ccc(Cl)cc2)c1=O
: