Target
Nischarin
Ligand
BDBM215805
Substrate
Meas. Tech.
I1 Receptor Binding Assay
pH
7.35±n/a
Temperature
310.15±n/a K
Ki
2.8±n/a nM
Comments
extracted
Citation
 Bousquet, PEhrhardt, JDFellmann, LGasparik, VGreney, HHadjeri, MMann, ANiederhoffer, NSchann, S Amino-pyrroline derivatives, and use thereof in the prevention and/or treatment of metabolic syndrome US Patent  US9303019 Publication Date 4/5/2016 
Target
Name:
Nischarin
Synonyms:
IRAS Imidazoline receptor 1 (I1R) NISCH Nischarin
Type:
Enzyme
Mol. Mass.:
166571.31
Organism:
Homo sapiens (Human)
Description:
Q9Y2I1
Residue:
1504
  
Inhibitor
Name:
BDBM215805
Synonyms:
US9303019, 20
Type:
Small organic molecule
Emp. Form.:
C14H17ClN2
Mol. Mass.:
248.751
SMILES:
CC1CCC(Nc2ccc(Cl)c3CCCc23)=N1
: