Target
Orexin receptor type 2
Ligand
BDBM221331
Substrate
Meas. Tech.
In Vitro Assay
Temperature
310.15±n/a K
IC50
30±n/a nM
Comments
extracted
Citation
 Bolli, MBoss, CBrotschi, CGude, MHeidmann, BSifferlen, TWilliams, JT Pyrazole and imidazole derivatives useful as orexin antagonists US Patent  US9303023 Publication Date 4/5/2016 
Target
Name:
Orexin receptor type 2
Synonyms:
HCRTR2 OX2R_HUMAN Orexin receptor type 2 (OR-2) Orexin receptor type 2 (OX2R) Ox-2-R | Ox2-R
Type:
Protein
Mol. Mass.:
50710.53
Organism:
Homo sapiens (Human)
Description:
O43614
Residue:
444
  
Inhibitor
Name:
BDBM221331
Synonyms:
US9303023, 30
Type:
Small organic molecule
Emp. Form.:
C25H23N5O2S
Mol. Mass.:
457.547
SMILES:
COc1ccc2[nH]cc(CCn3cc(NC(=O)c4ncsc4-c4cccc(C)c4)cn3)c2c1
: