Target
Hepatocyte growth factor receptor/Proto-oncogene tyrosine-protein kinase receptor Ret
Ligand
BDBM222077
Substrate
Meas. Tech.
In Vitro c-Met Enzyme Assay
IC50
1.234e+4± 2.15e+3 nM
Citation
 Yang, YZhang, YYang, LZhao, LSi, LZhang, HLiu, QZhou, J Discovery of imidazopyridine derivatives as novel c-Met kinase inhibitors: Synthesis, SAR study, and biological activity. Bioorg Chem 70:126-132 (2017)  
Target
Name:
Hepatocyte growth factor receptor/Proto-oncogene tyrosine-protein kinase receptor Ret
Synonyms:
c-Met/RET
Type:
Protein
Mol. Mass.:
Description:
Components:
This complex has 2 components.
Component 1
Name:
Hepatocyte growth factor receptor
Synonyms:
Hepatocyte growth factor receptor Hepatocyte growth factor receptor (c-MET) MET Met proto-oncogene (hepatocyte growth factor receptor) Tyrosine-protein kinase Met (c-Met) c-Met kinase
Type:
Protein
Mol. Mass.:
155559.73
Organism:
Homo sapiens (Human)
Description:
P08581
Residue:
1390
  
Component 2
Name:
Proto-oncogene tyrosine-protein kinase receptor Ret
Synonyms:
CDHF12 Cadherin family member 12 Proto-oncogene c-Ret RET51 Tyrosine-protein kinase Ret (RET)
Type:
Protein
Mol. Mass.:
124318.29
Organism:
Homo sapiens (Human)
Description:
P07949
Residue:
1114
  
Inhibitor
Name:
BDBM222077
Synonyms:
6-chloro-3-((2-(2,5-dichlorophenyl)imidazo[1,2-a]pyridin-8-yl)methoxy)-[1,2,4]triazolo[4,3-b] pyridazine (7e)
Type:
Small organic molecule
Emp. Form.:
C19H11Cl3N6O
Mol. Mass.:
445.689
SMILES:
Clc1ccc(Cl)c(c1)-c1cn2cccc(COc3nnc4ccc(Cl)nn34)c2n1
: