Target
Hepatocyte growth factor receptor/Proto-oncogene tyrosine-protein kinase receptor Ret
Ligand
BDBM24470
Substrate
Meas. Tech.
In Vitro c-Met Enzyme Assay
IC50
6e+1± 1e+1 nM
Citation
 Yang, YZhang, YYang, LZhao, LSi, LZhang, HLiu, QZhou, J Discovery of imidazopyridine derivatives as novel c-Met kinase inhibitors: Synthesis, SAR study, and biological activity. Bioorg Chem 70:126-132 (2017)  
Target
Name:
Hepatocyte growth factor receptor/Proto-oncogene tyrosine-protein kinase receptor Ret
Synonyms:
c-Met/RET
Type:
Protein
Mol. Mass.:
Description:
Components:
This complex has 2 components.
Component 1
Name:
Hepatocyte growth factor receptor
Synonyms:
Hepatocyte growth factor receptor Hepatocyte growth factor receptor (c-MET) MET Met proto-oncogene (hepatocyte growth factor receptor) Tyrosine-protein kinase Met (c-Met) c-Met kinase
Type:
Protein
Mol. Mass.:
155559.73
Organism:
Homo sapiens (Human)
Description:
P08581
Residue:
1390
  
Component 2
Name:
Proto-oncogene tyrosine-protein kinase receptor Ret
Synonyms:
CDHF12 Cadherin family member 12 Proto-oncogene c-Ret RET51 Tyrosine-protein kinase Ret (RET)
Type:
Protein
Mol. Mass.:
124318.29
Organism:
Homo sapiens (Human)
Description:
P07949
Residue:
1114
  
Inhibitor
Name:
BDBM24470
Synonyms:
7-methoxy-4-({6-phenyl-[1,2,4]triazolo[4,3-a]pyridazin-3-yl}methoxy)quinoline Triazolopyridazine, 4
Type:
Small organic molecule
Emp. Form.:
C22H17N5O2
Mol. Mass.:
383.4027
SMILES:
COc1ccc2c(OCc3nnc4ccc(nn34)-c3ccccc3)ccnc2c1
: