Target
Seed linoleate 13S-lipoxygenase-1
Ligand
BDBM222269
Substrate
Meas. Tech.
In Vitro Soybean Lipoxygenase (SLO) Inhibition Assay
pH
8±n/a
IC50
2.87e+5± 3.0 nM
Comments
extracted
Citation
 Vinayagam, JGajbhiye, RLMandal, LArumugam, MAchari, AJaisankar, P Substituted furans as potent lipoxygenase inhibitors: Synthesis, in vitro and molecular docking studies. Bioorg Chem 71:97-101 (2017)  
Target
Name:
Seed linoleate 13S-lipoxygenase-1
Synonyms:
15-LOX 15-lipo-oxygenase (SLO) L-1 LOX1.1 Lipoxygenase (LOX) Lipoxygenase-1 | Seed lipoxygenase-1
Type:
Enzyme
Mol. Mass.:
94365.66
Organism:
Glycine max (soybean)
Description:
Residue:
839
  
Inhibitor
Name:
BDBM222269
Synonyms:
2-Methyl-4-(2-oxo-2-phenyl-ethyl)-5-phenyl-furan-3-carboxylic acid ethyl ester (3b)
Type:
Small organic molecule
Emp. Form.:
C22H20O4
Mol. Mass.:
348.3918
SMILES:
CCOC(=O)c1c(C)oc(c1CC(=O)c1ccccc1)-c1ccccc1
: