Target
Seed linoleate 13S-lipoxygenase-1
Ligand
BDBM222273
Substrate
Meas. Tech.
In Vitro Soybean Lipoxygenase (SLO) Inhibition Assay
pH
8±n/a
IC50
2.12e+4± 0.5 nM
Comments
extracted
Citation
 Vinayagam, JGajbhiye, RLMandal, LArumugam, MAchari, AJaisankar, P Substituted furans as potent lipoxygenase inhibitors: Synthesis, in vitro and molecular docking studies. Bioorg Chem 71:97-101 (2017)  
Target
Name:
Seed linoleate 13S-lipoxygenase-1
Synonyms:
15-LOX 15-lipo-oxygenase (SLO) L-1 LOX1.1 Lipoxygenase (LOX) Lipoxygenase-1 | Seed lipoxygenase-1
Type:
Enzyme
Mol. Mass.:
94365.66
Organism:
Glycine max (soybean)
Description:
Residue:
839
  
Inhibitor
Name:
BDBM222273
Synonyms:
5-(4-Bromo-phenyl)-4[2-(4-bromo-phenyl)-2-oxo-ethyl]-2-methyl-furan-3-carboxylic acid ethyl ester (3f)
Type:
Small organic molecule
Emp. Form.:
C22H18Br2O4
Mol. Mass.:
506.184
SMILES:
CCOC(=O)c1c(C)oc(c1CC(=O)c1ccc(Br)cc1)-c1ccc(Br)cc1
: