Target
Urokinase plasminogen activator surface receptor
Ligand
BDBM222365
Substrate
Meas. Tech.
Fluorescence Polarization Assay
Ki
3600±800 nM
IC50
47300±2400 nM
Citation
 Liu, DXu, DLiu, MKnabe, WEYuan, CZhou, DHuang, MMeroueh, SO Small Molecules Engage Hot Spots through Cooperative Binding To Inhibit a Tight Protein-Protein Interaction. Biochemistry 56:1768-1784 (2017)  
Target
Name:
Urokinase plasminogen activator surface receptor
Synonyms:
CD_antigen=CD87 Monocyte activation antigen Mo3 U-PAR UPAR_HUMAN Urokinase receptor (uPAR) | Urokinase-type plasminogen activator/surface receptor
Type:
Receptor
Mol. Mass.:
36979.14
Organism:
Homo sapiens (Human)
Description:
Q03405
Residue:
335
  
Inhibitor
Name:
BDBM222365
Synonyms:
IPR-1196 (18)
Type:
Small organic molecule
Emp. Form.:
C24H20ClFN2O4
Mol. Mass.:
454.878
SMILES:
CC(C)(C)c1cc(no1)N1C(C(C(=O)c2ccc(Cl)cc2)=C(O)C1=O)c1cccc(F)c1
: