Target
Urokinase plasminogen activator surface receptor
Ligand
BDBM222367
Substrate
Meas. Tech.
Fluorescence Polarization Assay
Ki
8600±2100 nM
IC50
66500±2400 nM
Citation
 Liu, DXu, DLiu, MKnabe, WEYuan, CZhou, DHuang, MMeroueh, SO Small Molecules Engage Hot Spots through Cooperative Binding To Inhibit a Tight Protein-Protein Interaction. Biochemistry 56:1768-1784 (2017)  
Target
Name:
Urokinase plasminogen activator surface receptor
Synonyms:
CD_antigen=CD87 Monocyte activation antigen Mo3 U-PAR UPAR_HUMAN Urokinase receptor (uPAR) | Urokinase-type plasminogen activator/surface receptor
Type:
Receptor
Mol. Mass.:
36979.14
Organism:
Homo sapiens (Human)
Description:
Q03405
Residue:
335
  
Inhibitor
Name:
BDBM222367
Synonyms:
IPR-1119 (20)
Type:
Small organic molecule
Emp. Form.:
C28H24ClFN2O3
Mol. Mass.:
490.953
SMILES:
OC1=C(C(N(C1=O)c1ccc(cc1)N1CCCCC1)c1cccc(F)c1)C(=O)c1ccc(Cl)cc1
: