Target
Urokinase plasminogen activator surface receptor
Ligand
BDBM222371
Substrate
Meas. Tech.
Fluorescence Polarization Assay
Ki
15900±2800 nM
Citation
 Liu, DXu, DLiu, MKnabe, WEYuan, CZhou, DHuang, MMeroueh, SO Small Molecules Engage Hot Spots through Cooperative Binding To Inhibit a Tight Protein-Protein Interaction. Biochemistry 56:1768-1784 (2017)  
Target
Name:
Urokinase plasminogen activator surface receptor
Synonyms:
CD_antigen=CD87 Monocyte activation antigen Mo3 U-PAR UPAR_HUMAN Urokinase receptor (uPAR) | Urokinase-type plasminogen activator/surface receptor
Type:
Receptor
Mol. Mass.:
36979.14
Organism:
Homo sapiens (Human)
Description:
Q03405
Residue:
335
  
Inhibitor
Name:
BDBM222371
Synonyms:
IPR-1179 (24)
Type:
Small organic molecule
Emp. Form.:
C28H25BrClNO3
Mol. Mass.:
538.86
SMILES:
Cc1ccc(cc1Br)N1C(C(C(=O)c2ccc(Cl)cc2)=C(O)C1=O)c1ccc(cc1)C(C)(C)C
: