Target
Urokinase plasminogen activator surface receptor
Ligand
BDBM222380
Substrate
Meas. Tech.
Fluorescence Polarization Assay
Ki
17600±1600 nM
Citation
 Liu, DXu, DLiu, MKnabe, WEYuan, CZhou, DHuang, MMeroueh, SO Small Molecules Engage Hot Spots through Cooperative Binding To Inhibit a Tight Protein-Protein Interaction. Biochemistry 56:1768-1784 (2017)  
Target
Name:
Urokinase plasminogen activator surface receptor
Synonyms:
CD_antigen=CD87 Monocyte activation antigen Mo3 U-PAR UPAR_HUMAN Urokinase receptor (uPAR) | Urokinase-type plasminogen activator/surface receptor
Type:
Receptor
Mol. Mass.:
36979.14
Organism:
Homo sapiens (Human)
Description:
Q03405
Residue:
335
  
Inhibitor
Name:
BDBM222380
Synonyms:
IPR-1157 (33)
Type:
Small organic molecule
Emp. Form.:
C25H19BrClNO3
Mol. Mass.:
496.78
SMILES:
Cc1ccc(cc1)C1N(C(=O)C(O)=C1C(=O)c1ccc(Cl)cc1)c1ccc(C)c(Br)c1
: