Target
Urokinase plasminogen activator surface receptor
Ligand
BDBM222385
Substrate
Meas. Tech.
Fluorescence Polarization Assay
Ki
2300±200 nM
Citation
 Liu, DXu, DLiu, MKnabe, WEYuan, CZhou, DHuang, MMeroueh, SO Small Molecules Engage Hot Spots through Cooperative Binding To Inhibit a Tight Protein-Protein Interaction. Biochemistry 56:1768-1784 (2017)  
Target
Name:
Urokinase plasminogen activator surface receptor
Synonyms:
CD_antigen=CD87 Monocyte activation antigen Mo3 U-PAR UPAR_HUMAN Urokinase receptor (uPAR) | Urokinase-type plasminogen activator/surface receptor
Type:
Receptor
Mol. Mass.:
36979.14
Organism:
Homo sapiens (Human)
Description:
Q03405
Residue:
335
  
Inhibitor
Name:
BDBM222385
Synonyms:
IPR-1167 (38)
Type:
Small organic molecule
Emp. Form.:
C25H17Cl3FNO3
Mol. Mass.:
504.765
SMILES:
OC1=C(C(N(CCc2ccc(Cl)cc2Cl)C1=O)c1cccc(F)c1)C(=O)c1ccc(Cl)cc1
: