Target
Urokinase plasminogen activator surface receptor
Ligand
BDBM222387
Substrate
Meas. Tech.
Fluorescence Polarization Assay
Ki
3700±500 nM
IC50
93300±1600 nM
Citation
 Liu, DXu, DLiu, MKnabe, WEYuan, CZhou, DHuang, MMeroueh, SO Small Molecules Engage Hot Spots through Cooperative Binding To Inhibit a Tight Protein-Protein Interaction. Biochemistry 56:1768-1784 (2017)  
Target
Name:
Urokinase plasminogen activator surface receptor
Synonyms:
CD_antigen=CD87 Monocyte activation antigen Mo3 U-PAR UPAR_HUMAN Urokinase receptor (uPAR) | Urokinase-type plasminogen activator/surface receptor
Type:
Receptor
Mol. Mass.:
36979.14
Organism:
Homo sapiens (Human)
Description:
Q03405
Residue:
335
  
Inhibitor
Name:
BDBM222387
Synonyms:
IPR-1172 (40)
Type:
Small organic molecule
Emp. Form.:
C24H14ClF4NO4
Mol. Mass.:
491.819
SMILES:
OC1=C(C(N(C1=O)c1ccc(OC(F)(F)F)cc1)c1cccc(F)c1)C(=O)c1ccc(Cl)cc1
: