Target
Discoidin domain-containing receptor 2
Ligand
BDBM223092
Substrate
Meas. Tech.
LanthaScreen Eu Kinase Activity Assay
pH
7.5±n/a
Temperature
298.15±n/a K
IC50
6.29±2.13 nM
Comments
extracted
Citation
 Liu, LHussain, MLuo, JDuan, AChen, CTu, ZZhang, J Synthesis and biological evaluation of novel dasatinib analogues as potent DDR1 and DDR2 kinase inhibitors. Chem Biol Drug Des 89:420-427 (2017)  
Target
Name:
Discoidin domain-containing receptor 2
Synonyms:
DDR2 Discoidin domain receptor 2 (DDR2) Discoidin domain-containing receptor 2 (DDR2) NTRKR3 TYRO10
Type:
Protein
Mol. Mass.:
96717.07
Organism:
Homo sapiens (Human)
Description:
Q16832
Residue:
855
  
Inhibitor
Name:
BDBM223092
Synonyms:
2-((6-(4-Acryloylpiperazin-1-yl)-2-methylpyrimidin-4-yl)amino)-N-(2-chloro-6-methylphenyl)-thiazole-5-carboxamide (3l)
Type:
Small organic molecule
Emp. Form.:
C23H24ClN7O2S
Mol. Mass.:
498
SMILES:
Cc1nc(Nc2ncc(s2)C(=O)Nc2c(C)cccc2Cl)cc(n1)N1CCN(CC1)C(=O)C=C
: