Target
Discoidin domain-containing receptor 2
Ligand
BDBM223098
Substrate
Meas. Tech.
LanthaScreen Eu Kinase Activity Assay
pH
7.5±n/a
Temperature
298.15±n/a K
IC50
123±24 nM
Comments
extracted
Citation
 Liu, LHussain, MLuo, JDuan, AChen, CTu, ZZhang, J Synthesis and biological evaluation of novel dasatinib analogues as potent DDR1 and DDR2 kinase inhibitors. Chem Biol Drug Des 89:420-427 (2017)  
Target
Name:
Discoidin domain-containing receptor 2
Synonyms:
DDR2 Discoidin domain receptor 2 (DDR2) Discoidin domain-containing receptor 2 (DDR2) NTRKR3 TYRO10
Type:
Protein
Mol. Mass.:
96717.07
Organism:
Homo sapiens (Human)
Description:
Q16832
Residue:
855
  
Inhibitor
Name:
BDBM223098
Synonyms:
Butyl 3-(6-((5-((2-chloro-6-methylphenyl)carbamoyl)thiazol-2-yl)amino)-2-methylpyrimidin-4-yl)pyrrolidine-1-carboxylate (5e)
Type:
Small organic molecule
Emp. Form.:
C25H29ClN6O3S
Mol. Mass.:
529.054
SMILES:
CCCCOC(=O)N1CCC(C1)c1cc(Nc2ncc(s2)C(=O)Nc2c(C)cccc2Cl)nc(C)n1
: