Target
Discoidin domain-containing receptor 2
Ligand
BDBM223103
Substrate
Meas. Tech.
LanthaScreen Eu Kinase Activity Assay
pH
7.5±n/a
Temperature
298.15±n/a K
IC50
156±28 nM
Comments
extracted
Citation
 Liu, LHussain, MLuo, JDuan, AChen, CTu, ZZhang, J Synthesis and biological evaluation of novel dasatinib analogues as potent DDR1 and DDR2 kinase inhibitors. Chem Biol Drug Des 89:420-427 (2017)  
Target
Name:
Discoidin domain-containing receptor 2
Synonyms:
DDR2 Discoidin domain receptor 2 (DDR2) Discoidin domain-containing receptor 2 (DDR2) NTRKR3 TYRO10
Type:
Protein
Mol. Mass.:
96717.07
Organism:
Homo sapiens (Human)
Description:
Q16832
Residue:
855
  
Inhibitor
Name:
BDBM223103
Synonyms:
N-(2-chloro-6-methylphenyl)-2-((6-((1-(ethylsulfonyl)pyrrolidin-3-yl)amino)-2-methylpyrimidin-4-yl)amino)thiazole-5-carboxamide (5j)
Type:
Small organic molecule
Emp. Form.:
C22H26ClN7O3S2
Mol. Mass.:
536.07
SMILES:
CCS(=O)(=O)N1CCC(C1)Nc1cc(Nc2ncc(s2)C(=O)Nc2c(C)cccc2Cl)nc(C)n1
: