Target
Leukotriene C4 synthase
Ligand
BDBM223229
Substrate
LTC4
Meas. Tech.
In Vitro hLTC4 Synthase Enzyme Assay (Test A)
pH
7.8±n/a
IC50
263±n/a nM
Comments
extracted
Citation
 Ronn, RLindh, CJRingberg, EAndersson, HBNilsson, PSchaal, WRRosenschold, MMNikitidis, ANikitidis, GJohannesson, PTyrcha, C Compounds and uses  US Patent  US20160326143 Publication Date 11/10/2016 
Target
Name:
Leukotriene C4 synthase
Synonyms:
LTC4 synthase LTC4S_HUMAN | Leukotriene-C(4) synthase
Type:
PROTEIN
Mol. Mass.:
16575.59
Organism:
Homo sapiens (Human)
Description:
ChEMBL_961179
Residue:
150
  
Inhibitor
Name:
BDBM223229
Synonyms:
2-(5-((4-Chlorophenyl)((1-(methoxymethyl)cyclopropyl)methyl)amino)-3-methoxypicolinoyl)cyclopropanecarboxylic acid | US20160326143, 4
Type:
Small Organic Molecule
Emp. Form.:
C23H25ClN2O5
Mol. Mass.:
444.908
SMILES:
COCC(C1CC1)N(c1ccc(Cl)cc1)c1cnc(C(=O)C2CC2C(O)=O)c(OC)c1
:
Substrate
Name:
BDBM81801
Synonyms:
CAS_5283121 NSC_5283121
Type:
Small organic molecule
Emp. Form.:
C30H47N3O9S
Mol. Mass.:
625.774
SMILES:
CCCCCC=CCC=CC=CC=CC(SCC(NC(=O)CCC(N)C(O)=O)C(=O)NCC(O)=O)C(O)CCCC(O)=O
: