Target
Leukotriene C4 synthase
Ligand
BDBM223274
Substrate
LTC4
Meas. Tech.
In Vitro hLTC4 Synthase Enzyme Assay (Test A)
pH
7.8±n/a
IC50
65±n/a nM
Comments
extracted
Citation
 Ronn, RLindh, CJRingberg, EAndersson, HBNilsson, PSchaal, WRRosenschold, MMNikitidis, ANikitidis, GJohannesson, PTyrcha, C Compounds and uses  US Patent  US20160326143 Publication Date 11/10/2016 
Target
Name:
Leukotriene C4 synthase
Synonyms:
LTC4 synthase LTC4S_HUMAN | Leukotriene-C(4) synthase
Type:
PROTEIN
Mol. Mass.:
16575.59
Organism:
Homo sapiens (Human)
Description:
ChEMBL_961179
Residue:
150
  
Inhibitor
Name:
BDBM223274
Synonyms:
2-(4-((4-Chlorophenyl)(cyclopropylmethyl)amino)-2-methoxybenzoyl)cyclopropanecarboxylic acid US9657001, 49
Type:
Small Organic Molecule
Emp. Form.:
C22H22ClNO4
Mol. Mass.:
399.867
SMILES:
COc1cc(ccc1C(=O)C1CC1C(O)=O)N(CC1CC1)c1ccc(Cl)cc1
:
Substrate
Name:
BDBM81801
Synonyms:
CAS_5283121 NSC_5283121
Type:
Small organic molecule
Emp. Form.:
C30H47N3O9S
Mol. Mass.:
625.774
SMILES:
CCCCCC=CCC=CC=CC=CC(SCC(NC(=O)CCC(N)C(O)=O)C(=O)NCC(O)=O)C(O)CCCC(O)=O
: