Target
Adenosine deaminase
Ligand
BDBM223291
Substrate
Arabinofuranosyladenine (Ara-A)
Meas. Tech.
In Vitro ADA Activity Assay
pH
7.2±n/a
Temperature
303.15±n/a K
Ki
1± 0.1 nM
Comments
extracted
Citation
 Wu, PWan, DXu, GWang, GMa, HWang, TGao, YQi, JChen, XZhu, JLi, YQDeng, ZChen, W An Unusual Protector-Protégé Strategy for the Biosynthesis of Purine Nucleoside Antibiotics. Cell Chem Biol 24:171-181 (2017)  
Target
Name:
Adenosine deaminase
Synonyms:
Adenosine deaminase 3 (SanADA3)
Type:
Enzyme
Mol. Mass.:
38157.60
Organism:
Streptomyces antibioticus
Description:
GenBank: KT591401.1
Residue:
356
  
Inhibitor
Name:
BDBM223291
Synonyms:
Pentostatin (PTN)
Type:
Small organic molecule
Emp. Form.:
C11H16N4O4
Mol. Mass.:
268.2691
SMILES:
OC[C@H]1O[C@H](C[C@@H]1O)n1cnc2[C@H](O)CN=CNc12
:
Substrate
Name:
BDBM50144936
Synonyms:
CHEMBL1090 adenine arabinoside
Type:
Small organic molecule
Emp. Form.:
C10H13N5O4
Mol. Mass.:
267.2413
SMILES:
Nc1ncnc2n(cnc12)[C@@H]1O[C@H](CO)[C@@H](O)[C@@H]1O
: