Target
Sialidase A
Ligand
BDBM4994
Substrate
Meas. Tech.
Sialidase Assay
pH
9±n/a
Ki
1.77e+3±n/a nM
Comments
extracted
Citation
 Hayre, JKXu, GBorgianni, LTaylor, GLAndrew, PWDocquier, JDOggioni, MR Optimization of a direct spectrophotometric method to investigate the kinetics and inhibition of sialidases. BMC Biochem 13:19 (2012)  
Target
Name:
Sialidase A
Synonyms:
NANA_STREE Sialidase A | nanA
Type:
Enzyme
Mol. Mass.:
114737.08
Organism:
Streptococcus pneumoniae
Description:
P62576; spr1536
Residue:
1035
  
Inhibitor
Name:
BDBM4994
Synonyms:
(3R,4R,5S)-5-amino-4-acetamido-3-(pentan-3-yloxy)cyclohex-1-ene-1-carboxylic acid GS4071 | Oseltamivir carboxylate
Type:
Small organic molecule
Emp. Form.:
C14H24N2O4
Mol. Mass.:
284.3514
SMILES:
CCC(CC)O[C@@H]1C=C(C[C@H](N)[C@H]1NC(C)=O)C(O)=O
: