Target
Mas-related G-protein coupled receptor member X2
Ligand
BDBM224019
Substrate
Meas. Tech.
Intracellular Calcium Mobilization Assay
pH
7.4±0
Temperature
303.15±0 K
EC50
2.5e+4±3e+3 nM
Citation
 Lansu, KKarpiak, JLiu, JHuang, XPMcCorvy, JDKroeze, WKChe, TNagase, HCarroll, FIJin, JShoichet, BKRoth, BL In silico design of novel probes for the atypical opioid receptor MRGPRX2. Nat Chem Biol 13:529-536 (2017)  
Target
Name:
Mas-related G-protein coupled receptor member X2
Synonyms:
MRGPRX2 MRGX2_HUMAN Mas-related G-protein coupled receptor member X2
Type:
GPCR
Mol. Mass.:
37104.79
Organism:
Homo sapiens (Human)
Description:
Q96LB1
Residue:
330
  
Inhibitor
Name:
BDBM224019
Synonyms:
6-Acetylcodeine
Type:
Small organic molecule
Emp. Form.:
C20H23NO4
Mol. Mass.:
341.4009
SMILES:
COc1ccc2C[C@@H]3[C@@H]4C=C[C@H](OC(C)=O)[C@@H]5Oc1c2[C@]45CCN3C
: